Reaction Details
TargetMelanin-concentrating hormone receptor 1
LigandBDBM109808
Substrate/Competitorn/a
Meas. Tech.Binding Assay
Ki 12±0.0 nM
Citation Guzzo, PRSurman, MDHenderson, AJJiang, MX Azinone-substituted azapolycycle MCH-1 antagonists, methods of making, and use thereof US Patent US8618299 Publication Date 12/31/2013
 
Melanin-concentrating hormone receptor 1
Name:Melanin-concentrating hormone receptor 1
Type:G Protein-Coupled Receptor (GPCR)
Mol. Mass.:45976.27
Organism:Homo sapiens (Human)
Description:Membranes from CHO-K1 cells stably expressing human MCH1R were used in assays.
Residue:422
BDBM109808
NameBDBM109808
Synonyms:US8618299, 26
TypeSmall organic molecule
Emp. Form.C26H22F3N3O
Mol. Mass.449.4676
SMILESFC(F)(F)c1ccc(cc1)-c1ccn(-c2ccc3c4C5CCCN5CCc4[nH]c3c2)c(=O)c1