Reaction Details
TargetMelanin-concentrating hormone receptor 1
LigandBDBM109818
Substrate/Competitorn/a
Meas. Tech.Binding Assay
Ki 7±0.0 nM
Citation Guzzo, PRSurman, MDHenderson, AJJiang, MX Azinone-substituted azapolycycle MCH-1 antagonists, methods of making, and use thereof US Patent US8618299 Publication Date 12/31/2013
 
Melanin-concentrating hormone receptor 1
Name:Melanin-concentrating hormone receptor 1
Type:G Protein-Coupled Receptor (GPCR)
Mol. Mass.:45976.27
Organism:Homo sapiens (Human)
Description:Membranes from CHO-K1 cells stably expressing human MCH1R were used in assays.
Residue:422
BDBM109818
NameBDBM109818
Synonyms:US8618299, 36
TypeSmall organic molecule
Emp. Form.C27H25F3N4O
Mol. Mass.478.5088
SMILESCn1c2CC3CCCCN3Cc2c2ccc(cc12)-n1ccc(cc1=O)-c1ccc(nc1)C(F)(F)F