Reaction Details
TargetMelanin-concentrating hormone receptor 1
LigandBDBM109823
Substrate/Competitorn/a
Meas. Tech.Binding Assay
Ki 14±0.0 nM
Citation Guzzo, PRSurman, MDHenderson, AJJiang, MX Azinone-substituted azapolycycle MCH-1 antagonists, methods of making, and use thereof US Patent US8618299 Publication Date 12/31/2013
 
Melanin-concentrating hormone receptor 1
Name:Melanin-concentrating hormone receptor 1
Type:G Protein-Coupled Receptor (GPCR)
Mol. Mass.:45976.27
Organism:Homo sapiens (Human)
Description:Membranes from CHO-K1 cells stably expressing human MCH1R were used in assays.
Residue:422
BDBM109823
NameBDBM109823
Synonyms:US8618299, 41
TypeSmall organic molecule
Emp. Form.C25H21F3N4O
Mol. Mass.450.4556
SMILESFC(F)(F)c1ccc(cn1)-c1ccn(-c2ccc3c4CN5CCCC5Cc4[nH]c3c2)c(=O)c1