Reaction Details
TargetMelanin-concentrating hormone receptor 1
LigandBDBM109834
Substrate/Competitorn/a
Meas. Tech.Binding Assay
Ki 17±0.0 nM
Citation Guzzo, PRSurman, MDHenderson, AJJiang, MX Azinone-substituted azapolycycle MCH-1 antagonists, methods of making, and use thereof US Patent US8618299 Publication Date 12/31/2013
 
Melanin-concentrating hormone receptor 1
Name:Melanin-concentrating hormone receptor 1
Type:G Protein-Coupled Receptor (GPCR)
Mol. Mass.:45976.27
Organism:Homo sapiens (Human)
Description:Membranes from CHO-K1 cells stably expressing human MCH1R were used in assays.
Residue:422
BDBM109834
NameBDBM109834
Synonyms:US8618299, 52
TypeSmall organic molecule
Emp. Form.C26H23F3N4O
Mol. Mass.464.4822
SMILESCn1c2CC3CCCN3Cc2c2ccc(nc12)-n1ccc(cc1=O)-c1ccc(cc1)C(F)(F)F