Reaction Details
TargetCathepsin K
LigandBDBM109862
Substrate/Competitorn/a
Meas. Tech.Enzyme Inhibition Assay
Ki 1.8±0.0 nM
Citation Schudok, MWagner, MBauer, AKohlmann, A Spirocyclic nitriles as protease inhibitors US Patent US8609681 Publication Date 12/17/2013
 
Cathepsin K
Name:Cathepsin K
Type:Enzyme
Mol. Mass.:36975.68
Organism:Homo sapiens (Human)
Description:P43235
Residue:329
BDBM109862
NameBDBM109862
Synonyms:US8609681, 9
TypeSmall organic molecule
Emp. Form.C20H30F2N4O2
Mol. Mass.396.4746
SMILESCC(F)(F)C[C@H](NC(=O)N1CCC2(CCCCC2)CC1)C(=O)NC1(CC1)C#N