Reaction Details
TargetHistone deacetylase 6
LigandBDBM110027
Substrate/Competitorn/a
Meas. Tech.Enzyme Assays
pH7.4±0
IC50 2±0.0 nM
Citation Van Duzer, JHMazitschek, ROgier, WBradner, JEHuang, GXie, DYu, N Reverse amide compounds as protein deacetylase inhibitors and methods of use thereof US Patent US8609678 Publication Date 12/17/2013
 
Histone deacetylase 6
Name:Histone deacetylase 6
Type:Chromatin regulator; hydrolase; repressor
Mol. Mass.:131381.51
Organism:Homo sapiens (Human)
Description:Q9UBN7
Residue:1215
BDBM110027
NameBDBM110027
Synonyms:US8609678, N-(4-(7-(hydroxyamino)-7-oxoheptylcarbamoyl)phenyl)-N-phenylbenzamide [80]
TypeSmall organic molecule
Emp. Form.C27H29N3O4
Mol. Mass.459.5369
SMILESONC(=O)CCCCCCNC(=O)c1ccc(cc1)N(C(=O)c1ccccc1)c1ccccc1