Reaction Details
TargetCalpain-2 catalytic subunit
LigandBDBM23866
Substrate/Competitorn/a
Meas. Tech.m-Calpain Inhibition Assay
pH7.5±n/a
Temperature298.15±n/a K
IC50 150.0± 0.8 nM
Commentsextracted
Citation Baek, KHKarki, RLee, ESNa, YKwon, Y Synthesis and investigation of dihydroxychalcones as calpain and cathepsin inhibitors. Bioorg Chem51:24-30 (2013) 
 
Calpain-2 catalytic subunit
Name:Calpain-2 catalytic subunit
Type:Protein
Mol. Mass.:79965.18
Organism:Homo sapiens (Human)
Description:n/a
Residue:700
BDBM23866
NameBDBM23866
Synonyms:MDL28170 benzyl N-[(1S)-2-methyl-1-[(1-oxo-3-phenylpropan-2-yl)carbamoyl]propyl]carbamate med.21724, Compound 20
TypeSmall organic molecule
Emp. Form.C22H26N2O4
Mol. Mass.382.4528
SMILESCC(C)C(NC(=O)OCc1ccccc1)C(=O)NC(Cc1ccccc1)C=O