Reaction Details
TargetCalpain-2 catalytic subunit
LigandBDBM110188
Substrate/Competitorn/a
Meas. Tech.m-Calpain Inhibition Assay
pH7.5±n/a
Temperature298.15±n/a K
IC50>1.00e+5±n/a nM
Commentsextracted
Citation Baek, KHKarki, RLee, ESNa, YKwon, Y Synthesis and investigation of dihydroxychalcones as calpain and cathepsin inhibitors. Bioorg Chem51:24-30 (2013) 
 
Calpain-2 catalytic subunit
Name:Calpain-2 catalytic subunit
Type:Protein
Mol. Mass.:79965.18
Organism:Homo sapiens (Human)
Description:n/a
Residue:700
BDBM110188
NameBDBM110188
Synonyms:1-(2,4-Dihydroxyphenyl)-3-(pyridin-2-yl)propenone (8)
TypeSmall organic molecule
Emp. Form.C14H11NO3
Mol. Mass.241.242
SMILESOc1ccc(C(=O)\C=C\c2ccccn2)c(O)c1