Reaction Details
TargetCalpain-2 catalytic subunit
LigandBDBM110189
Substrate/Competitorn/a
Meas. Tech.m-Calpain Inhibition Assay
pH7.5±n/a
Temperature298.15±n/a K
IC50 3.989e+4± 1054 nM
Commentsextracted
Citation Baek, KHKarki, RLee, ESNa, YKwon, Y Synthesis and investigation of dihydroxychalcones as calpain and cathepsin inhibitors. Bioorg Chem51:24-30 (2013) 
 
Calpain-2 catalytic subunit
Name:Calpain-2 catalytic subunit
Type:Protein
Mol. Mass.:79965.18
Organism:Homo sapiens (Human)
Description:n/a
Residue:700
BDBM110189
NameBDBM110189
Synonyms:1-(2,4-Dihydroxyphenyl)-3-(thiophen-2-yl)propenone (9)
TypeSmall organic molecule
Emp. Form.C13H10O3S
Mol. Mass.246.282
SMILESOc1ccc(C(=O)\C=C\c2cccs2)c(O)c1