Reaction Details
TargetCalpain-2 catalytic subunit
LigandBDBM110192
Substrate/Competitorn/a
Meas. Tech.m-Calpain Inhibition Assay
pH7.5±n/a
Temperature298.15±n/a K
IC50>1.00e+5±n/a nM
Commentsextracted
Citation Baek, KHKarki, RLee, ESNa, YKwon, Y Synthesis and investigation of dihydroxychalcones as calpain and cathepsin inhibitors. Bioorg Chem51:24-30 (2013) 
 
Calpain-2 catalytic subunit
Name:Calpain-2 catalytic subunit
Type:Protein
Mol. Mass.:79965.18
Organism:Homo sapiens (Human)
Description:n/a
Residue:700
BDBM110192
NameBDBM110192
Synonyms:3-(2,4-Dihydroxyphenyl)-1-(furan-2-yl)propenone (14)
TypeSmall organic molecule
Emp. Form.C13H10O4
Mol. Mass.230.2161
SMILESOc1ccc(\C=C\C(=O)c2ccco2)c(O)c1