Reaction Details
TargetCalpain-2 catalytic subunit
LigandBDBM110193
Substrate/Competitorn/a
Meas. Tech.m-Calpain Inhibition Assay
pH7.5±n/a
Temperature298.15±n/a K
IC50>1.00e+5±n/a nM
Commentsextracted
Citation Baek, KHKarki, RLee, ESNa, YKwon, Y Synthesis and investigation of dihydroxychalcones as calpain and cathepsin inhibitors. Bioorg Chem51:24-30 (2013) 
 
Calpain-2 catalytic subunit
Name:Calpain-2 catalytic subunit
Type:Protein
Mol. Mass.:79965.18
Organism:Homo sapiens (Human)
Description:n/a
Residue:700
BDBM110193
NameBDBM110193
Synonyms:1-(3,5-Dihydroxyphenyl)-3-(thiophen-2-yl)propenone (20)
TypeSmall organic molecule
Emp. Form.C13H10O3S
Mol. Mass.246.282
SMILESOc1cc(O)cc(c1)C(=O)\C=C\c1cccs1