Reaction Details
TargetCalpain-2 catalytic subunit
LigandBDBM110196
Substrate/Competitorn/a
Meas. Tech.m-Calpain Inhibition Assay
pH7.5±n/a
Temperature298.15±n/a K
IC50 9.729e+4± 2357 nM
Commentsextracted
Citation Baek, KHKarki, RLee, ESNa, YKwon, Y Synthesis and investigation of dihydroxychalcones as calpain and cathepsin inhibitors. Bioorg Chem51:24-30 (2013) 
 
Calpain-2 catalytic subunit
Name:Calpain-2 catalytic subunit
Type:Protein
Mol. Mass.:79965.18
Organism:Homo sapiens (Human)
Description:n/a
Residue:700
BDBM110196
NameBDBM110196
Synonyms:1-(3,5-Dihydroxyphenyl)-3-(thiophen-3-yl)propenone (23)
TypeSmall organic molecule
Emp. Form.C13H10O3S
Mol. Mass.246.282
SMILESOc1cc(O)cc(c1)C(=O)\C=C\c1ccsc1