Reaction Details
TargetCathepsin B
LigandBDBM23866
Substrate/Competitorn/a
Meas. Tech.Cathepsin B Inhibition Assay
pH5.5±n/a
Temperature310.15±n/a K
IC50 95.8± 4.5 nM
Commentsextracted
Citation Baek, KHKarki, RLee, ESNa, YKwon, Y Synthesis and investigation of dihydroxychalcones as calpain and cathepsin inhibitors. Bioorg Chem51:24-30 (2013) 
 
Cathepsin B
Name:Cathepsin B
Type:Enzyme
Mol. Mass.:37819.69
Organism:Homo sapiens (Human)
Description:gi_63102437
Residue:339
BDBM23866
NameBDBM23866
Synonyms:MDL28170 benzyl N-[(1S)-2-methyl-1-[(1-oxo-3-phenylpropan-2-yl)carbamoyl]propyl]carbamate med.21724, Compound 20
TypeSmall organic molecule
Emp. Form.C22H26N2O4
Mol. Mass.382.4528
SMILESCC(C)C(NC(=O)OCc1ccccc1)C(=O)NC(Cc1ccccc1)C=O