Reaction Details
TargetProcathepsin L
LigandBDBM110192
Substrate/Competitorn/a
Meas. Tech.Cathepsin L Inhibition Assay
pH5.5±n/a
Temperature310.15±n/a K
IC50 2.87e+3± 52 nM
Commentsextracted
Citation Baek, KHKarki, RLee, ESNa, YKwon, Y Synthesis and investigation of dihydroxychalcones as calpain and cathepsin inhibitors. Bioorg Chem51:24-30 (2013) 
 
Procathepsin L
Name:Procathepsin L
Type:Enzyme
Mol. Mass.:37557.19
Organism:Homo sapiens (Human)
Description:Purchased from Calbiochem (San Diego, CA).
Residue:333
BDBM110192
NameBDBM110192
Synonyms:3-(2,4-Dihydroxyphenyl)-1-(furan-2-yl)propenone (14)
TypeSmall organic molecule
Emp. Form.C13H10O4
Mol. Mass.230.2161
SMILESOc1ccc(\C=C\C(=O)c2ccco2)c(O)c1