Reaction Details
TargetTyrosine-protein kinase CSK
LigandBDBM110202
Substrate/Competitorn/a
Meas. Tech.c-Src Kinase Inhibitory Activity Assay
pH7.5±n/a
Temperature298.15±n/a K
IC50 2.77e+4±n/a nM
Commentsextracted
Citation Chand, KPrasad, STiwari, RKShirazi, ANKumar, SParang, KSharma, SK Synthesis and evaluation of c-Src kinase inhibitory activity of pyridin-2(1H)-one derivatives. Bioorg Chem53:75-82 (2014) 
 
Tyrosine-protein kinase CSK
Name:Tyrosine-protein kinase CSK
Type:Tyrosine-protein kinase
Mol. Mass.:50707.30
Organism:Homo sapiens (Human)
Description:P41240
Residue:450
BDBM110202
NameBDBM110202
Synonyms:5-(2,4-Dihydroxybenzoyl)-1-hexylpyridin-2(1H)-one (32)
TypeSmall organic molecule
Emp. Form.C18H21NO4
Mol. Mass.315.3636
SMILESCCCCCCn1cc(ccc1=O)C(=O)c1ccc(O)cc1O