Reaction Details
TargetTyrosine-protein kinase CSK
LigandBDBM110205
Substrate/Competitorn/a
Meas. Tech.c-Src Kinase Inhibitory Activity Assay
pH7.5±n/a
Temperature298.15±n/a K
IC50 4.70e+4±n/a nM
Commentsextracted
Citation Chand, KPrasad, STiwari, RKShirazi, ANKumar, SParang, KSharma, SK Synthesis and evaluation of c-Src kinase inhibitory activity of pyridin-2(1H)-one derivatives. Bioorg Chem53:75-82 (2014) 
 
Tyrosine-protein kinase CSK
Name:Tyrosine-protein kinase CSK
Type:Tyrosine-protein kinase
Mol. Mass.:50707.30
Organism:Homo sapiens (Human)
Description:P41240
Residue:450
BDBM110205
NameBDBM110205
Synonyms:5-(2-Hydroxy-4-methoxybenzoyl)-1-isopropylpyridin-2(1H)- one (35)
TypeSmall organic molecule
Emp. Form.C16H17NO4
Mol. Mass.287.3105
SMILESCOc1ccc(C(=O)c2ccc(=O)n(c2)C(C)C)c(O)c1