Reaction Details
TargetTyrosine-protein kinase CSK
LigandBDBM110206
Substrate/Competitorn/a
Meas. Tech.c-Src Kinase Inhibitory Activity Assay
pH7.5±n/a
Temperature298.15±n/a K
IC50 1.25e+4±n/a nM
Commentsextracted
Citation Chand, KPrasad, STiwari, RKShirazi, ANKumar, SParang, KSharma, SK Synthesis and evaluation of c-Src kinase inhibitory activity of pyridin-2(1H)-one derivatives. Bioorg Chem53:75-82 (2014) 
 
Tyrosine-protein kinase CSK
Name:Tyrosine-protein kinase CSK
Type:Tyrosine-protein kinase
Mol. Mass.:50707.30
Organism:Homo sapiens (Human)
Description:P41240
Residue:450
BDBM110206
NameBDBM110206
Synonyms:1-[2-(Dimethylamino)ethyl]-5-(2-hydroxy-4-methoxybenzoyl) pyridin-2(1H)-one (36)
TypeSmall organic molecule
Emp. Form.C17H20N2O4
Mol. Mass.316.3517
SMILESCOc1ccc(C(=O)c2ccc(=O)n(CCN(C)C)c2)c(O)c1