Reaction Details
TargetHeat shock protein HSP 90-alpha
LigandBDBM110225
Substrate/Competitorn/a
Meas. Tech.Fluorescence Polarization Assay
pH7.3±0
IC50 10±0 nM
Citation Lawson, JDCo, EWStafford, JA HSP90 inhibitors US Patent US8618290 Publication Date 12/31/2013
 
Heat shock protein HSP 90-alpha
Name:Heat shock protein HSP 90-alpha
Type:Molecular Chaperone
Mol. Mass.:84623.45
Organism:Homo sapiens (Human)
Description:P07900
Residue:732
BDBM110225
NameBDBM110225
Synonyms:US8618290, 75
TypeSmall organic molecule
Emp. Form.C25H29FN6O4
Mol. Mass.496.534
SMILESCOc1cccc(n1)-c1cc(F)ccc1[C@H]1Cc2nc(N)nc(C)c2C(NOCCC[C@H](O)CO)=N1