Reaction Details
Target3-phosphoinositide-dependent protein kinase 1 [51-359]
LigandBDBM282381
Substrate/Competitorn/a
Meas. Tech.PDK1 kinase assay
IC50<100±n/a nM
Citation Arndt, JChan, TGuckian, KKumaravel, GLee, WLin, EYScott, DSun, LThomas, Jvan Vloten, KWang, DZhang, LErlanson, D Heterocyclic compounds useful as PDK1 inhibitors US Patent US10030016 Publication Date 7/24/2018
 
3-phosphoinositide-dependent protein kinase 1 [51-359]
Name:3-phosphoinositide-dependent protein kinase 1 [51-359]
Type:Enzyme Catalytic Domain
Mol. Mass.:35302.26
Organism:Homo sapiens (Human)
Description:O15530[51-359]
Residue:309
BDBM282381
NameBDBM282381
Synonyms:2-(4-(3-amino-1H-pyrazolo [3,4-b]pyridin-5-yl) benzylamino)-N-(4-fluoro- 2-methoxyphenyl)-5- (trifluoromethyl)nicotinamide | US10030016, Example 261
TypeSmall organic molecule
Emp. Form.C27H21F4N7O2
Mol. Mass.551.495
SMILESCOc1cc(F)ccc1NC(=O)c1cc(cnc1NCc1ccc(cc1)-c1cnc2[nH]nc(N)c2c1)C(F)(F)F