Reaction Details
TargetPhosphatidylinositol 4,5-bisphosphate 3-kinase catalytic subunit gamma isoform
LigandBDBM110464
Substrate/Competitorn/a
Meas. Tech.Biological Assay
IC50 23±n/a nM
Citation Gaillard, PPomel, VJeanclaude-Etter, IDorbais, JKlicic, JMontagne, C Quinoxaline inhibitors of phosphoinositide-3-kinases (PI3Ks) US Patent US8614215 Publication Date 12/24/2013
 
Phosphatidylinositol 4,5-bisphosphate 3-kinase catalytic subunit gamma isoform
Name:Phosphatidylinositol 4,5-bisphosphate 3-kinase catalytic subunit gamma isoform
Type:Enzyme Subunit
Mol. Mass.:126470.30
Organism:Homo sapiens (Human)
Description:P48736
Residue:1102
BDBM110464
NameBDBM110464
Synonyms:US8614215, 36
TypeSmall organic molecule
Emp. Form.C23H21FN4O4S
Mol. Mass.468.501
SMILESCOc1ccc(CCO)c(Nc2nc3ccccc3nc2NS(=O)(=O)c2ccc(F)cc2)c1