Reaction Details
TargetVascular endothelial growth factor receptor 1
LigandBDBM110647
Substrate/Competitorn/a
Meas. Tech.Kinase assays
pH7.2±n/a
Temperature298.15±n/a K
IC50 2±n/a nM
Commentsextracted
Citation Guo, XZhu, Z Compounds as tyrosine kinase modulators US Patent US8614234 Publication Date 12/24/2013
 
Vascular endothelial growth factor receptor 1
Name:Vascular endothelial growth factor receptor 1
Type:Receptor Tyrosine Kinase
Mol. Mass.:150800.23
Organism:Homo sapiens (Human)
Description:P17948
Residue:1338
BDBM110647
NameBDBM110647
Synonyms:US8614234, 115 | US9725433, 115
TypeSmall organic molecule
Emp. Form.C24H20N4O4
Mol. Mass.428.44
SMILESCc1cccc(NC(=O)Nc2ccc(Oc3ccnc(c3)-c3cc(c[nH]3)C(O)=O)cc2)c1