Reaction Details
TargetSerine/threonine-protein kinase pim-1
LigandBDBM110722
Substrate/Competitorn/a
Meas. Tech.Pim Kinase Binding Activity
pH7.2±n/a
Ki 0.007±n/a nM
Commentsextracted
Citation Hodges, AJMatteucci, MSharpe, ASun, MWang, XTsui, VH Pyrazol-4-yl-heterocyclyl-carboxamide compounds and methods of use US Patent US8614206 Publication Date 12/24/2013
 
Serine/threonine-protein kinase pim-1
Name:Serine/threonine-protein kinase pim-1
Type:Protein
Mol. Mass.:35681.82
Organism:Homo sapiens (Human)
Description:P11309
Residue:313
BDBM110722
NameBDBM110722
Synonyms:US8614206, 248
TypeSmall organic molecule
Emp. Form.C21H23F3N8O
Mol. Mass.460.4555
SMILESCn1ncc(NC(=O)c2nc(cnc2N)-c2ccccc2F)c1N1CC[C@@H](N)CC(F)(F)C1