Reaction Details
TargetSerine/threonine-protein kinase pim-1
LigandBDBM110730
Substrate/Competitorn/a
Meas. Tech.Pim Kinase Binding Activity
pH7.2±n/a
Ki 0.009±n/a nM
Commentsextracted
Citation Hodges, AJMatteucci, MSharpe, ASun, MWang, XTsui, VH Pyrazol-4-yl-heterocyclyl-carboxamide compounds and methods of use US Patent US8614206 Publication Date 12/24/2013
 
Serine/threonine-protein kinase pim-1
Name:Serine/threonine-protein kinase pim-1
Type:Protein
Mol. Mass.:35681.82
Organism:Homo sapiens (Human)
Description:P11309
Residue:313
BDBM110730
NameBDBM110730
Synonyms:US8614206, 256
TypeSmall organic molecule
Emp. Form.C21H24F3N7OS
Mol. Mass.479.522
SMILESCn1ncc(NC(=O)c2nc(sc2N)-c2c(F)cccc2F)c1N1CCC(N)CC(C)(F)C1