Reaction Details
TargetSerine/threonine-protein kinase pim-1
LigandBDBM110726
Substrate/Competitorn/a
Meas. Tech.Pim Kinase Binding Activity
pH7.2±n/a
Ki 0.002±n/a nM
Commentsextracted
Citation Hodges, AJMatteucci, MSharpe, ASun, MWang, XTsui, VH Pyrazol-4-yl-heterocyclyl-carboxamide compounds and methods of use US Patent US8614206 Publication Date 12/24/2013
 
Serine/threonine-protein kinase pim-1
Name:Serine/threonine-protein kinase pim-1
Type:Protein
Mol. Mass.:35681.82
Organism:Homo sapiens (Human)
Description:P11309
Residue:313
BDBM110726
NameBDBM110726
Synonyms:US8614206, 252 US8614206, 352 | US8614206, 353
TypeSmall organic molecule
Emp. Form.C22H27F2N7O2S
Mol. Mass.491.557
SMILESCOC1(C)CC(N)CCN(C1)c1c(NC(=O)c2nc(sc2N)-c2c(F)cccc2F)cnn1C