Reaction Details
TargetSerine/threonine-protein kinase pim-1
LigandBDBM110938
Substrate/Competitorn/a
Meas. Tech.Pim Kinase Binding Activity
pH7.2±n/a
Ki 0.003±n/a nM
Commentsextracted
Citation Hodges, AJMatteucci, MSharpe, ASun, MWang, XTsui, VH Pyrazol-4-yl-heterocyclyl-carboxamide compounds and methods of use US Patent US8614206 Publication Date 12/24/2013
 
Serine/threonine-protein kinase pim-1
Name:Serine/threonine-protein kinase pim-1
Type:Protein
Mol. Mass.:35681.82
Organism:Homo sapiens (Human)
Description:P11309
Residue:313
BDBM110938
NameBDBM110938
Synonyms:US8614206, 495
TypeSmall organic molecule
Emp. Form.C21H23F4N7OS
Mol. Mass.497.512
SMILESCn1ncc(NC(=O)c2nc(sc2N)-c2c(F)cccc2F)c1N1CCC(C)(N)CC(F)(F)C1