Reaction Details
TargetSerine/threonine-protein kinase/endoribonuclease IRE1
LigandBDBM111000
Substrate/Competitorn/a
Meas. Tech.In Vitro Enzyme Assays
pH7.5±n/a
Temperature303.15±n/a K
IC50 720±n/a nM
Citation Patterson, JBLonergan, DGFlynn, GAZeng, QPallai, PV IRE-1α inhibitors US Patent US8614253 Publication Date 12/24/2013
 
Serine/threonine-protein kinase/endoribonuclease IRE1
Name:Serine/threonine-protein kinase/endoribonuclease IRE1
Type:Enzyme
Mol. Mass.:109731.20
Organism:Homo sapiens (Human)
Description:O75460
Residue:977
BDBM111000
NameBDBM111000
Synonyms:US8614253, 3-31 US9963434, Compound 3-31
TypeSmall organic molecule
Emp. Form.C7H4Br2O2
Mol. Mass.279.913
SMILESOc1c(Br)cc(Br)cc1C=O