Reaction Details
TargetSerine/threonine-protein kinase/endoribonuclease IRE1
LigandBDBM111265
Substrate/Competitorn/a
Meas. Tech.In Vitro Enzyme Assays
pH7.5±n/a
Temperature303.15±n/a K
IC50 441±n/a nM
Citation Patterson, JBLonergan, DGFlynn, GAZeng, QPallai, PV IRE-1α inhibitors US Patent US8614253 Publication Date 12/24/2013
 
Serine/threonine-protein kinase/endoribonuclease IRE1
Name:Serine/threonine-protein kinase/endoribonuclease IRE1
Type:Enzyme
Mol. Mass.:109731.20
Organism:Homo sapiens (Human)
Description:O75460
Residue:977
BDBM111265
NameBDBM111265
Synonyms:US8614253, 43-25 | US9241942, 27-25
TypeSmall organic molecule
Emp. Form.C11H8O3
Mol. Mass.188.1794
SMILESOc1ccc(cc1C=O)-c1ccoc1