Reaction Details
TargetBreakpoint cluster region protein [1-693]
LigandBDBM50237710
Substrate/Competitorn/a
Meas. Tech.Kinase Assays
IC50 214±n/a nM
Citation Pan, XDong, JGao, HWang, FZhang, YWang, SZhang, J Design, synthesis and biological evaluation of pyridin-3-yl pyrimidines as potent Bcr-Abl inhibitors. Chem Biol Drug Des83:592-9 (2014) 
 
Breakpoint cluster region protein [1-693]
Name:Breakpoint cluster region protein [1-693]
Type:Protein
Mol. Mass.:76683.66
Organism:Homo sapiens (Human)
Description:P11274[1-693]
Residue:693
BDBM50237710
NameBDBM50237710
Synonyms:4-methyl-N-[3-(4-methyl-1H-imidazol-1-yl)-5-(trifluoromethyl)phenyl]-3-[(4-pyridin-3-ylpyrimidin-2-yl)amino]benzamide AMN107 NILOTINIB | US11649218, Example Nilotinib
TypeSmall organic molecule
Emp. Form.C28H22F3N7O
Mol. Mass.529.5158
SMILESCc1cn(cn1)-c1cc(NC(=O)c2ccc(C)c(Nc3nccc(n3)-c3cccnc3)c2)cc(c1)C(F)(F)F