Reaction Details
TargetProstaglandin G/H synthase 2
LigandBDBM17638
Substrate/Competitorn/a
Meas. Tech.Cyclooxygenase activity assay
pH8±n/a
Temperature310.15±n/a K
IC50 3.24e+3± 1e+1 nM
Commentsextracted
Citation Ahmad, WKumolosasi, EJantan, IBukhari, SNJasamai, M Effects of novel diarylpentanoid analogues of curcumin on secretory phospholipase A2 , cyclooxygenases, lipo-oxygenase, and microsomal prostaglandin E synthase-1. Chem Biol Drug Des83:670-81 (2014) 
 
Prostaglandin G/H synthase 2
Name:Prostaglandin G/H synthase 2
Type:Enzyme
Mol. Mass.:69003.89
Organism:Homo sapiens (Human)
Description:Recombinant Cox-2 provided by Cayman (Cayman Chemical Co.,Ann Arbor, MI).
Residue:604
BDBM17638
NameBDBM17638
Synonyms:2-{1-[(4-chlorophenyl)carbonyl]-5-methoxy-2-methyl-1H-indol-3-yl}acetic acid Indocin US11478464, Compound Indomethacin US9271961, Indomethacin | indometacin
TypeSmall organic molecule
Emp. Form.C19H16ClNO4
Mol. Mass.357.788
SMILESCOc1ccc2n(C(=O)c3ccc(Cl)cc3)c(C)c(CC(O)=O)c2c1