Reaction Details
TargetHigh affinity cGMP-specific 3',5'-cyclic phosphodiesterase 9A
LigandBDBM111902
Substrate/Competitorn/a
Meas. Tech.Scintillation Proximity Assay
pH7.5±n/a
Temperature273.15±n/a K
IC50 14±n/a nM
Citation Giovannini, RDorner-Ciossek, CEickmeier, CFiegen, DFox, TFuchs, KHeine, NRosenbrock, HSchaenzle, G Compounds for the treatment of CNS disorders US Patent US8623901 Publication Date 1/7/2014
 
High affinity cGMP-specific 3',5'-cyclic phosphodiesterase 9A
Name:High affinity cGMP-specific 3',5'-cyclic phosphodiesterase 9A
Type:Protein
Mol. Mass.:68488.40
Organism:Homo sapiens (Human)
Description:O76083
Residue:593
BDBM111902
NameBDBM111902
Synonyms:US8623901, 229
TypeSmall organic molecule
Emp. Form.C24H24N4O3
Mol. Mass.416.4724
SMILESCOc1ccc(cc1)-c1ccccc1Cc1nc2n(ncc2c(=O)[nH]1)C1CCOCC1