Reaction Details
TargetHigh affinity cGMP-specific 3',5'-cyclic phosphodiesterase 9A
LigandBDBM111907
Substrate/Competitorn/a
Meas. Tech.Scintillation Proximity Assay
pH7.5±n/a
Temperature273.15±n/a K
IC50 6±n/a nM
Citation Giovannini, RDorner-Ciossek, CEickmeier, CFiegen, DFox, TFuchs, KHeine, NRosenbrock, HSchaenzle, G Compounds for the treatment of CNS disorders US Patent US8623901 Publication Date 1/7/2014
 
High affinity cGMP-specific 3',5'-cyclic phosphodiesterase 9A
Name:High affinity cGMP-specific 3',5'-cyclic phosphodiesterase 9A
Type:Protein
Mol. Mass.:68488.40
Organism:Homo sapiens (Human)
Description:O76083
Residue:593
BDBM111907
NameBDBM111907
Synonyms:US8623901, 230-5
TypeSmall organic molecule
Emp. Form.C20H20N6O2
Mol. Mass.376.4118
SMILESO=c1[nH]c(Cc2ccccc2-c2cc[nH]n2)nc2n(ncc12)C1CCOCC1