Reaction Details
TargetTyrosine-protein kinase ABL1
LigandBDBM112032
Substrate/Competitorn/a
Meas. Tech.In Vitro Enzyme Assay
Ki 0.04±n/a nM
Citation Lyssikatos, JPGazzard, LJHanan, EKintz, SPurkey, HE Substituted 6,6-fused nitrogenous heterocyclic compounds and uses thereof US Patent US8623889 Publication Date 1/7/2014
 
Tyrosine-protein kinase ABL1
Name:Tyrosine-protein kinase ABL1
Type:Enzyme
Mol. Mass.:122897.30
Organism:Homo sapiens (Human)
Description:P00519
Residue:1130
BDBM112032
NameBDBM112032
Synonyms:US8623889, 30
TypeSmall organic molecule
Emp. Form.C19H15ClN2O2
Mol. Mass.338.788
SMILESOc1ccc(Cl)c(c1)-c1ccc2cc(NC(=O)C3CC3)ncc2c1