Reaction Details
TargetTyrosine-protein kinase ABL1
LigandBDBM112066
Substrate/Competitorn/a
Meas. Tech.In Vitro Enzyme Assay
Ki 0.02±n/a nM
Citation Lyssikatos, JPGazzard, LJHanan, EKintz, SPurkey, HE Substituted 6,6-fused nitrogenous heterocyclic compounds and uses thereof US Patent US8623889 Publication Date 1/7/2014
 
Tyrosine-protein kinase ABL1
Name:Tyrosine-protein kinase ABL1
Type:Enzyme
Mol. Mass.:122897.30
Organism:Homo sapiens (Human)
Description:P00519
Residue:1130
BDBM112066
NameBDBM112066
Synonyms:US8623889, 64
TypeSmall organic molecule
Emp. Form.C20H18N2O2
Mol. Mass.318.3691
SMILESCc1ccc(O)cc1-c1ccc2cc(NC(=O)C3CC3)ncc2c1