Reaction Details
TargetTyrosine-protein kinase ABL1
LigandBDBM112078
Substrate/Competitorn/a
Meas. Tech.In Vitro Enzyme Assay
Ki 0.06±n/a nM
Citation Lyssikatos, JPGazzard, LJHanan, EKintz, SPurkey, HE Substituted 6,6-fused nitrogenous heterocyclic compounds and uses thereof US Patent US8623889 Publication Date 1/7/2014
 
Tyrosine-protein kinase ABL1
Name:Tyrosine-protein kinase ABL1
Type:Enzyme
Mol. Mass.:122897.30
Organism:Homo sapiens (Human)
Description:P00519
Residue:1130
BDBM112078
NameBDBM112078
Synonyms:US8623889, 76
TypeSmall organic molecule
Emp. Form.C20H14FN3O
Mol. Mass.331.3431
SMILESFc1ccc(-c2ccc3cc(NC(=O)C4CC4)ncc3c2)c(c1)C#N