Reaction Details
TargetTyrosine-protein kinase ABL1
LigandBDBM112144
Substrate/Competitorn/a
Meas. Tech.In Vitro Enzyme Assay
Ki 0.04±n/a nM
Citation Lyssikatos, JPGazzard, LJHanan, EKintz, SPurkey, HE Substituted 6,6-fused nitrogenous heterocyclic compounds and uses thereof US Patent US8623889 Publication Date 1/7/2014
 
Tyrosine-protein kinase ABL1
Name:Tyrosine-protein kinase ABL1
Type:Enzyme
Mol. Mass.:122897.30
Organism:Homo sapiens (Human)
Description:P00519
Residue:1130
BDBM112144
NameBDBM112144
Synonyms:US8623889, 142
TypeSmall organic molecule
Emp. Form.C20H16N4O
Mol. Mass.328.3672
SMILESO=C(Nc1cc2ccc(cc2cn1)-c1cccc2[nH]ncc12)C1CC1