Reaction Details
TargetTyrosine-protein kinase ABL1
LigandBDBM112191
Substrate/Competitorn/a
Meas. Tech.In Vitro Enzyme Assay
Ki 0.09±n/a nM
Citation Lyssikatos, JPGazzard, LJHanan, EKintz, SPurkey, HE Substituted 6,6-fused nitrogenous heterocyclic compounds and uses thereof US Patent US8623889 Publication Date 1/7/2014
 
Tyrosine-protein kinase ABL1
Name:Tyrosine-protein kinase ABL1
Type:Enzyme
Mol. Mass.:122897.30
Organism:Homo sapiens (Human)
Description:P00519
Residue:1130
BDBM112191
NameBDBM112191
Synonyms:US8623889, 189
TypeSmall organic molecule
Emp. Form.C19H18N4O
Mol. Mass.318.3724
SMILESCc1c(N)cncc1-c1ccc2cc(NC(=O)C3CC3)ncc2c1