Reaction Details
TargetTyrosine-protein kinase ABL1
LigandBDBM112245
Substrate/Competitorn/a
Meas. Tech.In Vitro Enzyme Assay
Ki 0.05±n/a nM
Citation Lyssikatos, JPGazzard, LJHanan, EKintz, SPurkey, HE Substituted 6,6-fused nitrogenous heterocyclic compounds and uses thereof US Patent US8623889 Publication Date 1/7/2014
 
Tyrosine-protein kinase ABL1
Name:Tyrosine-protein kinase ABL1
Type:Enzyme
Mol. Mass.:122897.30
Organism:Homo sapiens (Human)
Description:P00519
Residue:1130
BDBM112245
NameBDBM112245
Synonyms:US8623889, 243
TypeSmall organic molecule
Emp. Form.C21H21N3O2
Mol. Mass.347.4103
SMILESC[C@H](O)c1cc(C)c(cn1)-c1ccc2cc(NC(=O)C3CC3)ncc2c1