Reaction Details
TargetTyrosine-protein kinase ABL1
LigandBDBM112254
Substrate/Competitorn/a
Meas. Tech.In Vitro Enzyme Assay
Ki 0.06±n/a nM
Citation Lyssikatos, JPGazzard, LJHanan, EKintz, SPurkey, HE Substituted 6,6-fused nitrogenous heterocyclic compounds and uses thereof US Patent US8623889 Publication Date 1/7/2014
 
Tyrosine-protein kinase ABL1
Name:Tyrosine-protein kinase ABL1
Type:Enzyme
Mol. Mass.:122897.30
Organism:Homo sapiens (Human)
Description:P00519
Residue:1130
BDBM112254
NameBDBM112254
Synonyms:US8623889, 252
TypeSmall organic molecule
Emp. Form.C19H16FN3O
Mol. Mass.321.3482
SMILESCc1ccncc1-c1ccc2cc(NC(=O)[C@H]3C[C@H]3F)ncc2c1