Reaction Details
TargetTyrosine-protein kinase ABL1
LigandBDBM112418
Substrate/Competitorn/a
Meas. Tech.In Vitro Enzyme Assay
Ki 0.0723±n/a nM
Citation Lyssikatos, JPGazzard, LJHanan, EKintz, SPurkey, HE Substituted 6,6-fused nitrogenous heterocyclic compounds and uses thereof US Patent US8623889 Publication Date 1/7/2014
 
Tyrosine-protein kinase ABL1
Name:Tyrosine-protein kinase ABL1
Type:Enzyme
Mol. Mass.:122897.30
Organism:Homo sapiens (Human)
Description:P00519
Residue:1130
BDBM112418
NameBDBM112418
Synonyms:US8623889, 417
TypeSmall organic molecule
Emp. Form.C19H15N5O
Mol. Mass.329.3553
SMILESO=C(Nc1cc2ccc(cc2cn1)-c1cccc2[nH]nnc12)C1CC1