Reaction Details
TargetTyrosine-protein kinase ABL1
LigandBDBM112438
Substrate/Competitorn/a
Meas. Tech.In Vitro Enzyme Assay
Ki 0.0799±n/a nM
Citation Lyssikatos, JPGazzard, LJHanan, EKintz, SPurkey, HE Substituted 6,6-fused nitrogenous heterocyclic compounds and uses thereof US Patent US8623889 Publication Date 1/7/2014
 
Tyrosine-protein kinase ABL1
Name:Tyrosine-protein kinase ABL1
Type:Enzyme
Mol. Mass.:122897.30
Organism:Homo sapiens (Human)
Description:P00519
Residue:1130
BDBM112438
NameBDBM112438
Synonyms:US8623889, 437
TypeSmall organic molecule
Emp. Form.C18H18FN3O2
Mol. Mass.327.3528
SMILESC[C@@H]1CCC(=O)N1c1ccc2cc(NC(=O)C3C[C@@H]3F)ncc2c1