Reaction Details
TargetReceptor-type tyrosine-protein kinase FLT3
LigandBDBM112464
Substrate/Competitorn/a
Meas. Tech.Kinase Assay
pH7.6±n/a
IC50 1.5±n/a nM
Citation Chen, XDai, KDuquette, JGribble, Jr., MWHuard, JNKeegan, KSLi, ZLively, SEMcGee, LRRagains, MLWang, XWeidner, MFZhang, J Fused tricyclic dual inhibitors of CDK 4/6 and FLT3 US Patent US8623885 Publication Date 1/7/2014
 
Receptor-type tyrosine-protein kinase FLT3
Name:Receptor-type tyrosine-protein kinase FLT3
Type:Enzyme
Mol. Mass.:112888.62
Organism:Homo sapiens (Human)
Description:P36888
Residue:993
BDBM112464
NameBDBM112464
Synonyms:US8623885, 5
TypeSmall organic molecule
Emp. Form.C26H29N7O2
Mol. Mass.471.5542
SMILESC[C@H]1CC[C@@H](CC1)n1c2cnccc2c2cnc(Nc3ccc4CN(CCc4n3)C(=O)CO)nc12