Reaction Details
TargetReceptor-type tyrosine-protein kinase FLT3
LigandBDBM112477
Substrate/Competitorn/a
Meas. Tech.Kinase Assay
pH7.6±n/a
IC50 1.6±n/a nM
Citation Chen, XDai, KDuquette, JGribble, Jr., MWHuard, JNKeegan, KSLi, ZLively, SEMcGee, LRRagains, MLWang, XWeidner, MFZhang, J Fused tricyclic dual inhibitors of CDK 4/6 and FLT3 US Patent US8623885 Publication Date 1/7/2014
 
Receptor-type tyrosine-protein kinase FLT3
Name:Receptor-type tyrosine-protein kinase FLT3
Type:Enzyme
Mol. Mass.:112888.62
Organism:Homo sapiens (Human)
Description:P36888
Residue:993
BDBM112477
NameBDBM112477
Synonyms:US8623885, 18a
TypeSmall organic molecule
Emp. Form.C27H31N7O
Mol. Mass.469.5813
SMILESC[C@H]1CC[C@@H](CC1)n1c2cnccc2c2cnc(Nc3ccc4CN(C[C@@H](C)c4n3)C(C)=O)nc12