Reaction Details
TargetCyclin-dependent kinase 4
LigandBDBM112467
Substrate/Competitorn/a
Meas. Tech.Kinase Assay
pH7.4±n/a
IC50 2.4±n/a nM
Citation Chen, XDai, KDuquette, JGribble, Jr., MWHuard, JNKeegan, KSLi, ZLively, SEMcGee, LRRagains, MLWang, XWeidner, MFZhang, J Fused tricyclic dual inhibitors of CDK 4/6 and FLT3 US Patent US8623885 Publication Date 1/7/2014
 
Cyclin-dependent kinase 4
Name:Cyclin-dependent kinase 4
Type:Enzyme Subunit
Mol. Mass.:33731.96
Organism:Homo sapiens (Human)
Description:P11802
Residue:303
BDBM112467
NameBDBM112467
Synonyms:US8623885, 8
TypeSmall organic molecule
Emp. Form.C27H33N7O2S
Mol. Mass.519.662
SMILESC[C@H]1CC[C@@H](CC1)n1c2cnccc2c2cnc(Nc3ccc4CN(CCS(C)(=O)=O)CCc4n3)nc12