Reaction Details
TargetTyrosine-protein kinase JAK3
LigandBDBM112535
Substrate/Competitorn/a
Meas. Tech.Inhibition Assay
pH7.2±n/a
Ki 0.009688±n/a nM
IC50 0.019375±n/a nM
Citation de Vicente Fidalgo, JHermann, JCLemoine, RLi, HLovey, AJSjogren, EBSoth, M Inhibitors of JAK US Patent US8618103 Publication Date 12/31/2013
 
Tyrosine-protein kinase JAK3
Name:Tyrosine-protein kinase JAK3
Type:Protein
Mol. Mass.:125111.08
Organism:Homo sapiens (Human)
Description:P52333
Residue:1124
BDBM112535
NameBDBM112535
Synonyms:US8618103, I-31
TypeSmall organic molecule
Emp. Form.C18H22N6O2S
Mol. Mass.386.471
SMILESCc1ccc(c(NC2CCCN(C2)S(C)(=O)=O)n1)-c1cnc2[nH]ccc2n1