Reaction Details
TargetTyrosine-protein kinase JAK3
LigandBDBM112546
Substrate/Competitorn/a
Meas. Tech.Inhibition Assay
pH7.2±n/a
Ki 0.000748±n/a nM
IC50 0.00149±n/a nM
Citation de Vicente Fidalgo, JHermann, JCLemoine, RLi, HLovey, AJSjogren, EBSoth, M Inhibitors of JAK US Patent US8618103 Publication Date 12/31/2013
 
Tyrosine-protein kinase JAK3
Name:Tyrosine-protein kinase JAK3
Type:Protein
Mol. Mass.:125111.08
Organism:Homo sapiens (Human)
Description:P52333
Residue:1124
BDBM112546
NameBDBM112546
Synonyms:US8618103, I-42
TypeSmall organic molecule
Emp. Form.C18H19N7O2S
Mol. Mass.397.454
SMILESO=S(=O)(CC#N)N1CCC[C@@H](C1)Nc1ncccc1-c1cnc2[nH]ccc2n1