Reaction Details
TargetTyrosine-protein kinase JAK3
LigandBDBM112568
Substrate/Competitorn/a
Meas. Tech.Inhibition Assay
pH7.2±n/a
Ki 0.0021±n/a nM
IC50 0.004205±n/a nM
Citation de Vicente Fidalgo, JHermann, JCLemoine, RLi, HLovey, AJSjogren, EBSoth, M Inhibitors of JAK US Patent US8618103 Publication Date 12/31/2013
 
Tyrosine-protein kinase JAK3
Name:Tyrosine-protein kinase JAK3
Type:Protein
Mol. Mass.:125111.08
Organism:Homo sapiens (Human)
Description:P52333
Residue:1124
BDBM112568
NameBDBM112568
Synonyms:US8618103, I-64
TypeSmall organic molecule
Emp. Form.C20H26N6O3S
Mol. Mass.430.524
SMILESCC(C)CS(=O)(=O)N1CC[C@@H](O)[C@@H](C1)Nc1ncccc1-c1cnc2[nH]ccc2n1