Reaction Details
TargetTyrosine-protein kinase JAK3
LigandBDBM112573
Substrate/Competitorn/a
Meas. Tech.Inhibition Assay
pH7.2±n/a
Ki 0.00098±n/a nM
IC50 0.00196±n/a nM
Citation de Vicente Fidalgo, JHermann, JCLemoine, RLi, HLovey, AJSjogren, EBSoth, M Inhibitors of JAK US Patent US8618103 Publication Date 12/31/2013
 
Tyrosine-protein kinase JAK3
Name:Tyrosine-protein kinase JAK3
Type:Protein
Mol. Mass.:125111.08
Organism:Homo sapiens (Human)
Description:P52333
Residue:1124
BDBM112573
NameBDBM112573
Synonyms:US8618103, I-69
TypeSmall organic molecule
Emp. Form.C19H25N7O2S
Mol. Mass.415.513
SMILESCC(C)CS(=O)(=O)N1CCC[C@@H](C1)Nc1ncncc1-c1cnc2[nH]ccc2n1