Reaction Details
TargetTyrosine-protein kinase JAK2
LigandBDBM112589
Substrate/Competitorn/a
Meas. Tech.Inhibition Assay
pH7.2±n/a
IC50 0.0668±n/a nM
Citation de Vicente Fidalgo, JHermann, JCLemoine, RLi, HLovey, AJSjogren, EBSoth, M Inhibitors of JAK US Patent US8618103 Publication Date 12/31/2013
 
Tyrosine-protein kinase JAK2
Name:Tyrosine-protein kinase JAK2
Type:Protein
Mol. Mass.:130684.68
Organism:Homo sapiens (Human)
Description:O60674
Residue:1132
BDBM112589
NameBDBM112589
Synonyms:US8618103, I-85
TypeSmall organic molecule
Emp. Form.C18H24N8O3S
Mol. Mass.432.5
SMILESCS(=O)(=O)N1CCC[C@@H](C1)Nc1nc(NCCO)ncc1-c1cnc2[nH]ccc2n1