Reaction Details
TargetCystathionine gamma-lyase
LigandBDBM112640
Substrate/Competitorn/a
Meas. Tech.Human CSE enzyme assay
pH7±n/a
Temperature310.15±n/a K
IC50>2.00e+5±n/a nM
Commentsextracted
Citation Ren, JZhang, YJin, HYu, JZhou, YWu, FZhang, W Novel inhibitors of human DOPA decarboxylase extracted from Euonymus glabra Roxb. ACS Chem Biol9:897-903 (2014) 
 
Cystathionine gamma-lyase
Name:Cystathionine gamma-lyase
Type:Protein
Mol. Mass.:44509.52
Organism:Homo sapiens (Human)
Description:P32929
Residue:405
BDBM112640
NameBDBM112640
Synonyms:(2R)-3′,4′-Dihydroxy-7-methoxyflavan (13)
TypeSmall organic molecule
Emp. Form.C16H16O4
Mol. Mass.272.2958
SMILESCOc1ccc2CC[C@@H](Oc2c1)c1ccc(O)c(O)c1