Reaction Details
TargetGag-Pol polyprotein [484-582,Q491K,I497V,V499I,E519D,R541K,D544E,L547P,Q553K,A555V,G557S,I568V,L573M,L574M]
LigandBDBM112659
Substrate/Competitorn/a
Meas. Tech.HIV-1 protease inhibition assay
pH4.7±n/a
Temperature298.15±n/a K
Ki 0.022±0.010 nM
Commentsextracted
Citation Nalam, MNAli, AReddy, GSCao, HAnjum, SGAltman, MDYilmaz, NKTidor, BRana, TMSchiffer, CA Substrate envelope-designed potent HIV-1 protease inhibitors to avoid drug resistance. Chem Biol20:1116-24 (2013) 
 
Gag-Pol polyprotein [484-582,Q491K,I497V,V499I,E519D,R541K,D544E,L547P,Q553K,A555V,G557S,I568V,L573M,L574M]
Name:Gag-Pol polyprotein [484-582,Q491K,I497V,V499I,E519D,R541K,D544E,L547P,Q553K,A555V,G557S,I568V,L573M,L574M]
Type:Protein
Mol. Mass.:10804.78
Organism:Human immunodeficiency virus
Description:HIV-1 protease mutant (L10I, L63P, A71V, G73S, I84V, L90M)
Residue:99
BDBM112659
NameBDBM112659
Synonyms:(3R,3aS,6aR)-Hexahydrofuro[2,3-b]furan-3-yl ((2S,3R)-4-(4-amino-N-(2-ethylbutyl)phenylsulfonamido)-3-hydroxy-1-phenylbutan-2-yl)carbamate (11a)
TypeSmall organic molecule
Emp. Form.C29H41N3O7S
Mol. Mass.575.717
SMILESCCC(CC)CN(C[C@@H](O)[C@H](Cc1ccccc1)NC(=O)O[C@H]1CO[C@H]2OCC[C@@H]12)S(=O)(=O)c1ccc(N)cc1